Results 1 to 2 of 2

Thread: error informix

  1. #1
    Join Date
    Dec 2002
    Location
    Madrid - Spain
    Posts
    422
    Provided Answers: 1

    Unanswered: error informix

    Hi,

    I am compiling a program in suse linux 8.2 and informix 7.32 UC1 and the process compilation show me this error.

    The following errors were discovered during compilation.
    /usr/informix732/lib/tools/lib4gsh732.so: referencia a `tparm' sin definir
    /usr/informix732/lib/tools/lib4gsh732.so: referencia a `tigetflag' sin definir
    /usr/informix732/lib/tools/lib4gsh732.so: referencia a `tigetstr' sin definir
    /usr/informix732/lib/tools/lib4gsh732.so: referencia a `setupterm' sin definir
    /usr/informix732/lib/tools/lib4gsh732.so: referencia a `tigetnum' sin definir
    collect2: ld returned 1 exit status

    Thank you for you help.

  2. #2
    Join Date
    Jul 2003
    Location
    Munich
    Posts
    26

    Re: error informix

    Originally posted by georgipa
    Hi,

    I am compiling a program in suse linux 8.2 and informix 7.32 UC1 and the process compilation show me this error.

    The following errors were discovered during compilation.
    /usr/informix732/lib/tools/lib4gsh732.so: referencia a `tparm' sin definir
    /usr/informix732/lib/tools/lib4gsh732.so: referencia a `tigetflag' sin definir
    /usr/informix732/lib/tools/lib4gsh732.so: referencia a `tigetstr' sin definir
    /usr/informix732/lib/tools/lib4gsh732.so: referencia a `setupterm' sin definir
    /usr/informix732/lib/tools/lib4gsh732.so: referencia a `tigetnum' sin definir
    collect2: ld returned 1 exit status

    Thank you for you help.
    Hi You should install the

    ncurses-5.2-283.i386.rpm
    this can be downloaded at:

    Attention ONE LINE!!!

    http://rpmseek.com/rpm/ncurses-5.2-2...0:162086:0:0:0

Posting Permissions

  • You may not post new threads
  • You may not post replies
  • You may not post attachments
  • You may not edit your posts
  •