1. I am using perl 5.8.1 and trying to install dbi-1.30
2. I am using the version of perl that came with my mac 5.8.1.
3. I down loaded mysql-standard-4.0.1.8 binary installer from cpan and installed and successfully created a database.
4. I installed the os x developer tools and xcode tools.

here is my terminal

Last login: Fri Feb 27 19:31:18 on ttyp1
Welcome to Darwin!
raymond-marinos-Computer:~ ray$ cd desktop/dbi-1.30
raymond-marinos-Computer:~/desktop/dbi-1.30 ray$ perl makefile.pl

*** You are using a perl configured with threading enabled.
*** You should be aware that using multiple threads is
*** not recommended for production environments.

*** Note:
The optional PlRPC-modules (RPC::PlServer etc) are not installed.
If you want to use the DBD::Proxy driver and DBI::ProxyServer
modules, then you'll need to install the RPC::PlServer, RPC::PlClient,
Storable and Net:aemon modules. The CPAN Bundle:BI may help you.
You can install them any time after installing the DBI.
You do *not* need these modules for typical DBI usage.

Optional modules are available from any CPAN mirror, in particular
http://www.perl.com/CPAN/modules/by-module
http://www.perl.org/CPAN/modules/by-module
ftp://ftp.funet.fi/pub/languages/per...ules/by-module

Creating extra DBI::PurePerl test: t/zz_01basics_pp.t
Creating extra DBI::PurePerl test: t/zz_02dbidrv_pp.t
Creating extra DBI::PurePerl test: t/zz_03hleak_pp.t
Creating extra DBI::PurePerl test: t/zz_04mods_pp.t
Creating extra DBI::PurePerl test: t/zz_05thrclone_pp.t (use threads)
Creating extra DBI::PurePerl test: t/zz_10examp_pp.t
Creating extra DBI::PurePerl test: t/zz_15array_pp.t
Creating extra DBI::PurePerl test: t/zz_20meta_pp.t
Creating extra DBI::PurePerl test: t/zz_30subclass_pp.t
Creating extra DBI::PurePerl test: t/zz_40profile_pp.t
Creating extra DBI::PurePerl test: t/zz_60preparse_pp.t
Creating extra DBI::PurePerl test: t/zz_70shell_pp.t
Creating extra DBI::PurePerl test: t/zz_80proxy_pp.t
Writing Makefile for DBI

Remember to actually *read* the README file!
Use 'make' to build the software (dmake or nmake on Windows).
Then 'make test' to execute self tests.
Then 'make install' to install the DBI and then delete this working
directory before unpacking and building any DBD::* drivers.

raymond-marinos-Computer:~/desktop/dbi-1.30 ray$ make
cc -c -g -pipe -pipe -fno-common -DPERL_DARWIN -no-cpp-precomp -fno-strict-aliasing -I/usr/local/include -Os -DVERSION=\"1.30\" -DXS_VERSION=\"1.30\" "-I/System/Library/Perl/5.8.1/darwin-thread-multi-2level/CORE" -Wall -Wno-comment DBI.c
DBI.xs: In function `XS_DBD_____st_bind_col':
DBI.xs:3347: warning: operation on `lna' may be undefined
DBI.xs: In function `XS_DBD_____st_bind_columns':
DBI.xs:3368: warning: operation on `lna' may be undefined
/usr/include/stdio.h: At top level:
DBIXS.h:411: warning: `get_dbistate' defined but not used
Running Mkbootstrap for DBI ()
chmod 644 DBI.bs
rm -f blib/arch/auto/DBI/DBI.bundle
LD_RUN_PATH="" MACOSX_DEPLOYMENT_TARGET=10.3 cc -bundle -undefined dynamic_lookup -L/usr/local/lib DBI.o -o blib/arch/auto/DBI/DBI.bundle
ld: -undefined: unknown argument: dynamic_lookup
make: *** [blib/arch/auto/DBI/DBI.bundle] Error 1
raymond-marinos-Computer:~/desktop/dbi-1.30 ray$ make test
rm -f blib/arch/auto/DBI/DBI.bundle
LD_RUN_PATH="" MACOSX_DEPLOYMENT_TARGET=10.3 cc -bundle -undefined dynamic_lookup -L/usr/local/lib DBI.o -o blib/arch/auto/DBI/DBI.bundle
ld: -undefined: unknown argument: dynamic_lookup
make: *** [blib/arch/auto/DBI/DBI.bundle] Error 1
raymond-marinos-Computer:~/desktop/dbi-1.30 ray$ sudo make install
Password:
rm -f blib/arch/auto/DBI/DBI.bundle
LD_RUN_PATH="" MACOSX_DEPLOYMENT_TARGET=10.3 cc -bundle -undefined dynamic_lookup -L/usr/local/lib DBI.o -o blib/arch/auto/DBI/DBI.bundle
ld: -undefined: unknown argument: dynamic_lookup
make: *** [blib/arch/auto/DBI/DBI.bundle] Error 1
raymond-marinos-Computer:~/desktop/dbi-1.30 ray$

what do you think the problem is? I really am lost here please help thank you very much. peace